BDBM50412717 AC-55541::CHEMBL493076
SMILES CC(=NNC(=O)C(NC(=O)c1ccccc1)c1n[nH]c(=O)c2ccccc12)c1cccc(Br)c1
InChI Key InChIKey=UCUHFWIFSHROPY-UHFFFAOYSA-N
Data  4 EC50
  Tab Delimited (TSV)   2D SDfile   Computed 3D by Vconf -m prep SDfile
Find this compound or compounds like it in BindingDB:
Activity Spreadsheet -- Enzyme Inhibition Constant Data from BindingDB
Found 4 hits for monomerid = 50412717
TargetProteinase-activated receptor 2(Homo sapiens (Human))
The University Of Queensland
Curated by ChEMBL
LigandPNGBDBM50412717(AC-55541 | CHEMBL493076)
Affinity DataEC50:  200nM. Assay description: Agonist activity at human PAR2 expressed in HEK293T cells assessed as increase in intracellular calcium level by bioluminescence assay
In DepthDetails ArticlePubMed
TargetProteinase-activated receptor 2(Homo sapiens (Human))
The University Of Queensland
Curated by ChEMBL
LigandPNGBDBM50412717(AC-55541 | CHEMBL493076)
Affinity DataEC50:  200nM. Assay description: Agonist activity at human PAR2 expressed in HEK293T cells assessed as effect on intracellular calcium mobilization by R-SAT assay
In DepthDetails ArticlePubMed
TargetProteinase-activated receptor 2(Homo sapiens (Human))
The University Of Queensland
Curated by ChEMBL
LigandPNGBDBM50412717(AC-55541 | CHEMBL493076)
Affinity DataEC50:  200nM. Assay description: Agonist activity at human PAR2 expressed in HEK293T cells assessed as stimulation of cell proliferation after 5 days by beta-galactosidase assay
In DepthDetails ArticlePubMed
TargetProteinase-activated receptor 2(Homo sapiens (Human))
The University Of Queensland
Curated by ChEMBL
LigandPNGBDBM50412717(AC-55541 | CHEMBL493076)
Affinity DataEC50:  200nM. Assay description: Agonist activity at human PAR2 expressed in HEK293T cells assessed as stimulation of phosphatidylinositol hydrolysis after 45 mins by scintillation c...
In DepthDetails ArticlePubMed