BDBM50413191 CHEMBL609108
SMILES Nc1ncnc2n(cnc12)C1CC(O)C(COS(=O)(=O)NC(=O)c2ccccc2O)O1
InChI Key InChIKey=UPNOFARSRPSEFA-UHFFFAOYSA-N
Data  1 KI
  Tab Delimited (TSV)   2D SDfile   Computed 3D by Vconf -m prep SDfile
Find this compound or compounds like it in BindingDB:
Activity Spreadsheet -- Enzyme Inhibition Constant Data from BindingDB
Found 1 hit for monomerid = 50413191
TargetSalicyl-AMP ligase / salicyl-S-ArCP synthetase(Mycobacterium tuberculosis)
University Of Minnesota
Curated by ChEMBL
LigandPNGBDBM50413191(CHEMBL609108)
Affinity DataKi:  3.5nM. Assay description: Inhibition of Mycobacterium tuberculosis BAG RV143 MbtA expressed in Escherichia coli BL21 (DE3) assessed as ATP-[32P]PPi exchange by liquid scintill...
In DepthDetails ArticlePubMed