BDBM50413260 CHEMBL198794
SMILES CCCCCCCCCc1ccc(cc1)-c1ccc(cc1)C(O)=O
InChI Key InChIKey=JEDSQOLKNJLVRX-UHFFFAOYSA-N
Data  4 EC50
  Tab Delimited (TSV)   2D SDfile   Computed 3D by Vconf -m prep SDfile
Find this compound or compounds like it in BindingDB:
Activity Spreadsheet -- Enzyme Inhibition Constant Data from BindingDB
Found 4 hits for monomerid = 50413260
TargetRetinoic acid receptor beta(Homo sapiens (Human))
Acadia Pharmaceuticals
Curated by ChEMBL
LigandPNGBDBM50413260(CHEMBL198794)
Affinity DataEC50:  15.8nM. Assay description: Agonist activity at RARbeta2 expressed in mouse NIH3T3 cells by R-SAT assay
In DepthDetails ArticlePubMed
TargetRetinoic acid receptor beta(Homo sapiens (Human))
Acadia Pharmaceuticals
Curated by ChEMBL
LigandPNGBDBM50413260(CHEMBL198794)
Affinity DataEC50:  316nM. Assay description: Transcriptional activity against RARbeta1
In DepthDetails ArticlePubMed
TargetRetinoic acid receptor beta(Homo sapiens (Human))
Acadia Pharmaceuticals
Curated by ChEMBL
LigandPNGBDBM50413260(CHEMBL198794)
Affinity DataEC50:  16nM. Assay description: Transcriptional activity against RARbeta2
In DepthDetails ArticlePubMed
TargetRetinoic acid receptor beta(Homo sapiens (Human))
Acadia Pharmaceuticals
Curated by ChEMBL
LigandPNGBDBM50413260(CHEMBL198794)
Affinity DataEC50:  316nM. Assay description: Activity at RARbeta1 expressed in mouse NIH3T3 cells by R-SAT assay
In DepthDetails ArticlePubMed