BDBM50416397 CHEMBL1210515
SMILES O=C(Cn1nc(cc(Cc2ccco2)c1=O)C1CCCCC1)NC1Cc2ccccc2C1
InChI Key InChIKey=RPQHJWKLRRXKIS-UHFFFAOYSA-N
Data  3 IC50  1 EC50
  Tab Delimited (TSV)   2D SDfile   Computed 3D by Vconf -m prep SDfile
Find this compound or compounds like it in BindingDB:
Activity Spreadsheet -- Enzyme Inhibition Constant Data from BindingDB
Found 4 hits for monomerid = 50416397
Target5-hydroxytryptamine receptor 3A(Homo sapiens (Human))
Glaxosmithkline
Curated by ChEMBL
LigandPNGBDBM50416397(CHEMBL1210515)
Affinity DataIC50:  7.94E+3nM. Assay description: Antagonist activity at human 5HT3 receptor
In DepthDetails ArticlePubMed
TargetNeuronal acetylcholine receptor subunit alpha-7(Homo sapiens (Human))
Glaxosmithkline
Curated by ChEMBL
LigandPNGBDBM50416397(CHEMBL1210515)
Affinity DataEC50:  2nM. Assay description: Positive allosteric modulator activity at human alpha7 nAChR expressed in rat GH4C1 assessed as calcium mobilization by FLIPR assay
In DepthDetails ArticlePubMed
TargetAcetylcholine receptor subunit alpha(Homo sapiens (Human))
Glaxosmithkline
Curated by ChEMBL
LigandPNGBDBM50416397(CHEMBL1210515)
Affinity DataIC50:  794nM. Assay description: Antagonist activity at human alpha1 nAChR in human TE671 cells
In DepthDetails ArticlePubMed
TargetNeuronal acetylcholine receptor subunit alpha-3(Homo sapiens (Human))
Glaxosmithkline
Curated by ChEMBL
LigandPNGBDBM50416397(CHEMBL1210515)
Affinity DataIC50:  1.00E+3nM. Assay description: Antagonist activity at human alpha3 nAChR in human IMR32 cells
In DepthDetails ArticlePubMed