BDBM50417307 CHEMBL1276494
SMILES CCN1CCC[C@H]1CNC(=O)c1c(OC)c(O)cc(Br)c1OC
InChI Key InChIKey=NLIPZVMIMUCCIK-JTQLQIEISA-N
Data  1 IC50
  Tab Delimited (TSV)   2D SDfile   Computed 3D by Vconf -m prep SDfile
Find this compound or compounds like it in BindingDB:
Activity Spreadsheet -- Enzyme Inhibition Constant Data from BindingDB
Found 1 hit for monomerid = 50417307
TargetD(2) dopamine receptor(Homo sapiens (Human))
University Of Mazandaran
Curated by ChEMBL
LigandPNGBDBM50417307(CHEMBL1276494)
Affinity DataIC50:  1.41nM. Assay description: Antagonist activity at dopamine D2 receptor
In DepthDetails ArticlePubMed