BDBM50419544 CHEMBL1929277
SMILES CC1(C)CCCN(CCCc2cccc3occc23)C1
InChI Key InChIKey=GILCEBZBWQMDQQ-UHFFFAOYSA-N
Data  2 KI
  Tab Delimited (TSV)   2D SDfile   Computed 3D by Vconf -m prep SDfile
Find this compound or compounds like it in BindingDB:
Activity Spreadsheet -- Enzyme Inhibition Constant Data from BindingDB
Found 2 hits for monomerid = 50419544
Target3-beta-hydroxysteroid-Delta(8),Delta(7)-isomerase(Cavia porcellus)
Universit£
Curated by ChEMBL
LigandPNGBDBM50419544(CHEMBL1929277)
Affinity DataKi:  1.10nM. Assay description: Displacement of [3H]-emopamil from delta(8)-delta(7) sterol isomerase in guinea pig liver membranes
In DepthDetails ArticlePubMed
TargetSigma non-opioid intracellular receptor 1(Cavia porcellus (Guinea pig))
Universit£
Curated by ChEMBL
LigandPNGBDBM50419544(CHEMBL1929277)
Affinity DataKi:  63.5nM. Assay description: Displacement of [3H]-(+)-pentazocine from sigma1 receptor in guinea pig brain membranes without cerebellum
In DepthDetails ArticlePubMed