BDBM50420240 CHEMBL2074590
SMILES CC(=O)Oc1c[nH]c2ccccc12
InChI Key InChIKey=JBOPQACSHPPKEP-UHFFFAOYSA-N
Data  2 KI  1 IC50
  Tab Delimited (TSV)   2D SDfile   Computed 3D by Vconf -m prep SDfile
Find this compound or compounds like it in BindingDB:
Activity Spreadsheet -- Enzyme Inhibition Constant Data from BindingDB
Found 3 hits for monomerid = 50420240
TargetSolute carrier family 22 member 8(Homo sapiens (Human))
University Of Tokyo
Curated by ChEMBL
LigandPNGBDBM50420240(CHEMBL2074590)
Affinity DataKi:  4.91E+5nM. Assay description: TP_TRANSPORTER: inhibition of benzylpenicillin uptake in OAT3-expressing HEK293 cells
In DepthDetails ArticlePubMed
TargetSolute carrier family 22 member 8(Rattus norvegicus)
University Of Tokyo
Curated by ChEMBL
LigandPNGBDBM50420240(CHEMBL2074590)
Affinity DataKi:  5.82E+5nM. Assay description: TP_TRANSPORTER: inhibition of benzylpenicillin uptake in Oat3-expressing HEK293 cells
In DepthDetails ArticlePubMed
TargetSolute carrier family 22 member 6(Homo sapiens (Human))
Tokyo Women'S Medical University
Curated by ChEMBL
LigandPNGBDBM50420240(CHEMBL2074590)
Affinity DataIC50:  8.30E+4nM. Assay description: TP_TRANSPORTER: inhibition of PAH uptake in OAT-expressing OK cells
In DepthDetails ArticlePubMed