BDBM50420244 CHEMBL1628111
SMILES C[C@]12CC[C@H]3[C@@H](CCc4cc(OS(O)(=O)=O)ccc34)[C@@H]1CC[C@@H]2O
InChI Key InChIKey=QZIGLSSUDXBTLJ-ZBRFXRBCSA-N
Data  2 KI
  Tab Delimited (TSV)   2D SDfile   Computed 3D by Vconf -m prep SDfile
Find this compound or compounds like it in BindingDB:
Activity Spreadsheet -- Enzyme Inhibition Constant Data from BindingDB
Found 2 hits for monomerid = 50420244
TargetMultidrug resistance-associated protein 1(Homo sapiens (Human))
Queen'S University
Curated by ChEMBL
LigandPNGBDBM50420244(CHEMBL1628111)
Affinity DataKi:  380nM. Assay description: TP_TRANSPORTER: inhibition of LTC4 uptake in membrane vesicle from MRP1-expressing HeLa cells
In DepthDetails ArticlePubMed
TargetSolute carrier organic anion transporter family member 1A1(Rattus norvegicus)
Albert Einstein College Of Medicine
Curated by ChEMBL
LigandPNGBDBM50420244(CHEMBL1628111)
Affinity DataKi:  1.10E+3nM. Assay description: TP_TRANSPORTER: inhibition of E217betaG uptake in Oatp1-expressing HeLa cells
In DepthDetails ArticlePubMed