BDBM50420256 CHEMBL1615585
SMILES CC(=O)OCC1=C(N2[C@H](SC1)[C@@H](N)C2=O)C(O)=O
InChI Key InChIKey=HSHGZXNAXBPPDL-IMTBSYHQSA-N
Data  2 KI
  Tab Delimited (TSV)   2D SDfile   Computed 3D by Vconf -m prep SDfile
Find this compound or compounds like it in BindingDB:
Activity Spreadsheet -- Enzyme Inhibition Constant Data from BindingDB
Found 2 hits for monomerid = 50420256
TargetSolute carrier family 15 member 2(Rattus norvegicus)
Biozentrum Of The Martin-Luther-University Halle-Wittenberg
Curated by ChEMBL
LigandPNGBDBM50420256(CHEMBL1615585)
Affinity DataKi:  4.90E+6nM. Assay description: TP_TRANSPORTER: inhibition of Gly-Sar uptake (pH6.0) in SKPT cells
In DepthDetails ArticlePubMed
TargetSolute carrier family 15 member 1(Homo sapiens (Human))
Biozentrum Of The Martin-Luther-University Halle-Wittenberg
Curated by ChEMBL
LigandPNGBDBM50420256(CHEMBL1615585)
Affinity DataKi: >1.00E+7nM. Assay description: TP_TRANSPORTER: inhibition of Gly-Sar uptake (pH6.0) in Caco-2 cells
In DepthDetails ArticlePubMed