BDBM50422394 CHEMBL3558149
SMILES Clc1ccccc1C[n+]1ccc(\C=C2\C(=O)Nc3ccccc23)cc1
InChI Key InChIKey=RHYIUHUONWWZJC-UHFFFAOYSA-N
Data  2 IC50
  Tab Delimited (TSV)   2D SDfile   Computed 3D by Vconf -m prep SDfile
Find this compound or compounds like it in BindingDB:
Activity Spreadsheet -- Enzyme Inhibition Constant Data from BindingDB
Found 2 hits for monomerid = 50422394
TargetCholinesterase(Equus caballus (Horse))
Tehran University Of Medical Sciences
Curated by ChEMBL
LigandPNGBDBM50422394(CHEMBL3558149)
Affinity DataIC50:  1.37E+6nM. Assay description: Inhibition of equine serum BChE using butyrylthiocholine iodide as substrate preincubated for 10 mins followed by substrate addition measured for 6 m...
In DepthDetails ArticlePubMed
TargetAcetylcholinesterase(Electrophorus electricus (Electric eel))
Tehran University Of Medical Sciences
Curated by ChEMBL
LigandPNGBDBM50422394(CHEMBL3558149)
Affinity DataIC50:  0.400nM. Assay description: Inhibition of electric eel AChE using acetylthiocholine iodide as substrate preincubated for 10 mins followed by substrate addition measured for 6 mi...
In DepthDetails ArticlePubMed