BDBM50423527 7A-Methyl-Testosterone::7Alpha-Methyl-Testosterone::CHEMBL359619
SMILES C[C@@H]1CC2=CC(=O)CC[C@]2(C)[C@H]2CC[C@]3(C)[C@@H](O)CC[C@H]3[C@H]12
InChI Key InChIKey=HZWZHWTZLZZBFF-UQYBFTDGSA-N
Data  1 Kd
  Tab Delimited (TSV)   2D SDfile   Computed 3D by Vconf -m prep SDfile
Find this compound or compounds like it in BindingDB:
Activity Spreadsheet -- Enzyme Inhibition Constant Data from BindingDB
Found 1 hit for monomerid = 50423527
TargetSex hormone-binding globulin(Homo sapiens (Human))
University Of British Columbia
Curated by ChEMBL
LigandPNGBDBM50423527(7A-Methyl-Testosterone | 7Alpha-Methyl-Testosteron...)
Affinity DataKd:  2nM. Assay description: Displacement of [3H]5alpha dihydrotestosterone from human sex hormone binding globulin
In DepthDetails ArticlePubMed