BDBM50423868 CHEMBL2023738
SMILES COc1ccc(cc1)-n1nc2c(NC(=O)CCC(=O)NCCCCCCCCN)nc3ccccc3n2c1=O
InChI Key InChIKey=DLZJVASQJDLGMG-UHFFFAOYSA-N
Data  1 Kd
  Tab Delimited (TSV)   2D SDfile   Computed 3D by Vconf -m prep SDfile
Find this compound or compounds like it in BindingDB:
Activity Spreadsheet -- Enzyme Inhibition Constant Data from BindingDB
Found 1 hit for monomerid = 50423868
TargetAdenosine receptor A3(Homo sapiens (Human))
University Of Nottingham
Curated by ChEMBL
LigandPNGBDBM50423868(CHEMBL2023738)
Affinity DataKd:  0.331nM. Assay description: Antagonist activity at human adenosine A3 receptor expressed in forskolin-stimulated CHO cells assessed as inhibition of NECA-induced CRE-SPAP gene t...
In DepthDetails ArticlePubMed