BDBM50424568 CHEMBL2312510
SMILES COc1c(Oc2cccnc2C)ncnc1N1C2CC3CC1CC(C2)N3C(=O)OC1(C)CC1
InChI Key InChIKey=VGIOZQMDHCDIJC-UHFFFAOYSA-N
Data  1 KI  1 EC50
  Tab Delimited (TSV)   2D SDfile   Computed 3D by Vconf -m prep SDfile
Find this compound or compounds like it in BindingDB:
Activity Spreadsheet -- Enzyme Inhibition Constant Data from BindingDB
Found 2 hits for monomerid = 50424568
TargetGlucose-dependent insulinotropic receptor(Homo sapiens (Human))
Pfizer
Curated by ChEMBL
LigandPNGBDBM50424568(CHEMBL2312510)
Affinity DataKi:  3.12E+3nM. Assay description: Binding affinity to human GPR119 in HEK293FT cell membrane by radioligand binding assay
In DepthDetails ArticlePubMed
TargetGlucose-dependent insulinotropic receptor(Homo sapiens (Human))
Pfizer
Curated by ChEMBL
LigandPNGBDBM50424568(CHEMBL2312510)
Affinity DataEC50:  1.03E+3nM. Assay description: Agonist activity at human GPR119 in HEK293 cells assessed as cAMP accumulation after 30 mins by CRE-beta-lactamase reporter gene assay
In DepthDetails ArticlePubMed