BDBM50424571 CHEMBL2312501
SMILES Cc1ncn(n1)-c1ccc(Oc2ncnc(N3C4CC5CC3CC(C4)N5C(=O)OC(C)(C)C)c2C)c(F)c1
InChI Key InChIKey=UAOJXKOJGNIAGM-UHFFFAOYSA-N
Data  1 KI  1 EC50
  Tab Delimited (TSV)   2D SDfile   Computed 3D by Vconf -m prep SDfile
Find this compound or compounds like it in BindingDB:
Activity Spreadsheet -- Enzyme Inhibition Constant Data from BindingDB
Found 2 hits for monomerid = 50424571
TargetGlucose-dependent insulinotropic receptor(Homo sapiens (Human))
Pfizer
Curated by ChEMBL
LigandPNGBDBM50424571(CHEMBL2312501)
Affinity DataKi:  507nM. Assay description: Binding affinity to human GPR119 in HEK293FT cell membrane by radioligand binding assay
In DepthDetails ArticlePubMed
TargetGlucose-dependent insulinotropic receptor(Homo sapiens (Human))
Pfizer
Curated by ChEMBL
LigandPNGBDBM50424571(CHEMBL2312501)
Affinity DataEC50:  300nM. Assay description: Agonist activity at human GPR119 in HEK293 cells assessed as cAMP accumulation after 30 mins by CRE-beta-lactamase reporter gene assay
In DepthDetails ArticlePubMed