BDBM50424578 CHEMBL2311545
SMILES Cc1c(Oc2ccc(cc2)-n2cncn2)ncnc1N1C2CC3CC1CC(C2)N3C(=O)OC(C)(C)C
InChI Key InChIKey=WEPVJCFKSJZVKD-UHFFFAOYSA-N
Data  1 KI  1 EC50
  Tab Delimited (TSV)   2D SDfile   Computed 3D by Vconf -m prep SDfile
Find this compound or compounds like it in BindingDB:
Activity Spreadsheet -- Enzyme Inhibition Constant Data from BindingDB
Found 2 hits for monomerid = 50424578
TargetGlucose-dependent insulinotropic receptor(Homo sapiens (Human))
Pfizer
Curated by ChEMBL
LigandPNGBDBM50424578(CHEMBL2311545)
Affinity DataKi:  125nM. Assay description: Binding affinity to human GPR119 in HEK293FT cell membrane by radioligand binding assay
In DepthDetails ArticlePubMed
TargetGlucose-dependent insulinotropic receptor(Homo sapiens (Human))
Pfizer
Curated by ChEMBL
LigandPNGBDBM50424578(CHEMBL2311545)
Affinity DataEC50:  140nM. Assay description: Agonist activity at human GPR119 in HEK293 cells assessed as cAMP accumulation after 30 mins by CRE-beta-lactamase reporter gene assay
In DepthDetails ArticlePubMed