BDBM50424582 CHEMBL2312514
SMILES CC(C)OC(=O)N1C2CC3CC1CC(C2)N3c1ncnc(Oc2ccc(cc2)-n2ccnn2)c1C
InChI Key InChIKey=QVBUMEULLREINA-UHFFFAOYSA-N
Data  1 KI  1 EC50
  Tab Delimited (TSV)   2D SDfile   Computed 3D by Vconf -m prep SDfile
Find this compound or compounds like it in BindingDB:
Activity Spreadsheet -- Enzyme Inhibition Constant Data from BindingDB
Found 2 hits for monomerid = 50424582
TargetGlucose-dependent insulinotropic receptor(Homo sapiens (Human))
Pfizer
Curated by ChEMBL
LigandPNGBDBM50424582(CHEMBL2312514)
Affinity DataKi:  294nM. Assay description: Binding affinity to human GPR119 in HEK293FT cell membrane by radioligand binding assay
In DepthDetails ArticlePubMed
TargetGlucose-dependent insulinotropic receptor(Homo sapiens (Human))
Pfizer
Curated by ChEMBL
LigandPNGBDBM50424582(CHEMBL2312514)
Affinity DataEC50:  202nM. Assay description: Agonist activity at human GPR119 in HEK293 cells assessed as cAMP accumulation after 30 mins by CRE-beta-lactamase reporter gene assay
In DepthDetails ArticlePubMed