BDBM50426425 CHEMBL2322330
SMILES OCCOCCn1ccc2ncnc(Nc3ccc(Oc4cccc(NC(=O)NC5CCCCC5)c4)c(Cl)c3)c12
InChI Key InChIKey=WDGCQQKABPWBPZ-UHFFFAOYSA-N
Data  1 IC50
PDB links: 2 PDB IDs match this monomer.
  Tab Delimited (TSV)   2D SDfile   Computed 3D by Vconf -m prep SDfile
Find this compound or compounds like it in BindingDB:
Activity Spreadsheet -- Enzyme Inhibition Constant Data from BindingDB
Found 1 hit for monomerid = 50426425
TargetEpidermal growth factor receptor(Homo sapiens (Human))
Takeda Pharmaceutical
Curated by ChEMBL
LigandPNGBDBM50426425(CHEMBL2322330)
Affinity DataIC50:  6.90nM. Assay description: Inhibition of human wild type EGFR expressed in Sf9 cells using [gamma32P]-ATP after 10 mins by scintillation counting