BDBM50427130 CHEMBL2323447
SMILES CN1[C@@H]2C[C@@H](OC(C)=O)[C@@H]1C[C@H](C2)OC(=O)c1ccccc1
InChI Key InChIKey=DLIFIQGFJYIOIZ-YHUYYLMFSA-N
Data  2 KI
  Tab Delimited (TSV)   2D SDfile   Computed 3D by Vconf -m prep SDfile
Find this compound or compounds like it in BindingDB:
Activity Spreadsheet -- Enzyme Inhibition Constant Data from BindingDB
Found 2 hits for monomerid = 50427130
TargetMuscarinic acetylcholine receptor M3(RAT)
Shanghai Jiao Tong University
Curated by ChEMBL
LigandPNGBDBM50427130(CHEMBL2323447)
Affinity DataKi:  7.10E+4nM. Assay description: Displacement of [3H]NMS from muscarinic M3 receptor in Sprague-Dawley rat submandibulary gland after 60 mins
In DepthDetails ArticlePubMed
TargetMuscarinic acetylcholine receptor M2(RAT)
Shanghai Jiao Tong University
Curated by ChEMBL
LigandPNGBDBM50427130(CHEMBL2323447)
Affinity DataKi:  7.70E+4nM. Assay description: Displacement of [3H]NMS from muscarinic M2 receptor in Sprague-Dawley rat left atria after 60 mins
In DepthDetails ArticlePubMed