BDBM50432501 CHEMBL2349617
SMILES CN1C(N)=NC2(CC(C)(C)Oc3ccc(cc23)-c2cc(Cl)cc(Cl)c2)C1=O
InChI Key InChIKey=ZXOLJYUYPJRDLJ-UHFFFAOYSA-N
Data  2 IC50  1 EC50
  Tab Delimited (TSV)   2D SDfile   Computed 3D by Vconf -m prep SDfile
Find this compound or compounds like it in BindingDB:
Activity Spreadsheet -- Enzyme Inhibition Constant Data from BindingDB
Found 3 hits for monomerid = 50432501
TargetBeta-secretase 1(Homo sapiens (Human))
Array Biopharma
Curated by ChEMBL
LigandPNGBDBM50432501(CHEMBL2349617)
Affinity DataIC50:  28nM. Assay description: Inhibition of human recombinant BACE1 expressed in CHO cells using biotin-Lys-Thr-Glu-Glu-Ile-Ser-Glu-Val-Asn-Leu-Asp-Ala-Glu-Phe-Arg-His-Asp-Ser-Gly...
In DepthDetails ArticlePubMed
TargetCathepsin D(Homo sapiens (Human))
Array Biopharma
Curated by ChEMBL
LigandPNGBDBM50432501(CHEMBL2349617)
Affinity DataIC50:  185nM. Assay description: Inhibition of human spleen cathepsin D using 5-FAM/QXL as peptide substrate after 1 hr by FRET assay
In DepthDetails ArticlePubMed
TargetBeta-secretase 1(Homo sapiens (Human))
Array Biopharma
Curated by ChEMBL
LigandPNGBDBM50432501(CHEMBL2349617)
Affinity DataEC50:  184nM. Assay description: Inhibition of BACE1 in HEK293 cells expressing wild type APP assessed as level of amyloid beta (1 to 40) after 48 hrs by HTRF assay
In DepthDetails ArticlePubMed