BDBM50433370 CHEMBL2375482
SMILES Brc1ccc(cc1)-c1nnc2sc(nn12)-c1ccoc1
InChI Key InChIKey=QYCOFCLOPMEREV-UHFFFAOYSA-N
Data  1 IC50
  Tab Delimited (TSV)   2D SDfile   Computed 3D by Vconf -m prep SDfile
Find this compound or compounds like it in BindingDB:
Activity Spreadsheet -- Enzyme Inhibition Constant Data from BindingDB
Found 1 hit for monomerid = 50433370
TargetIntestinal-type alkaline phosphatase(Bos taurus (Cattle))
Quaid-I-Azam University
Curated by ChEMBL
LigandPNGBDBM50433370(CHEMBL2375482)
Affinity DataIC50:  61nM. Assay description: Inhibition of calf intestinal alkaline phosphatase using p-NPP as substrate incubated for 10 mins prior to substrate addition measured after 30 mins ...
In DepthDetails ArticlePubMed