BDBM50433404 CHEMBL2380641
SMILES CS(=O)(=O)N1CCN(CC1)c1cnc(nc1)N1CCN(C(=O)N[C@H]2C3CC4CC2C[C@](O)(C4)C3)c2ccccc12
InChI Key InChIKey=PKGINCVLUORIEU-DTZVNRBHSA-N
Data  3 IC50
  Tab Delimited (TSV)   2D SDfile   Computed 3D by Vconf -m prep SDfile
Find this compound or compounds like it in BindingDB:
Activity Spreadsheet -- Enzyme Inhibition Constant Data from BindingDB
Found 3 hits for monomerid = 50433404
Target11-beta-hydroxysteroid dehydrogenase 1(Homo sapiens (Human))
Sanofi R & D
Curated by ChEMBL
LigandPNGBDBM50433404(CHEMBL2380641)
Affinity DataIC50:  14nM. Assay description: Inhibition of human recombinant 11beta-HSD1 by scintillation proximity assay
In DepthDetails ArticlePubMed
Target11-beta-hydroxysteroid dehydrogenase 1(Rattus norvegicus (rat))
Sanofi R & D
Curated by ChEMBL
LigandPNGBDBM50433404(CHEMBL2380641)
Affinity DataIC50:  28nM. Assay description: Inhibition of rat 11beta-HSD1
In DepthDetails ArticlePubMed
Target11-beta-hydroxysteroid dehydrogenase 1(Mus musculus (mouse))
Sanofi R & D
Curated by ChEMBL
LigandPNGBDBM50433404(CHEMBL2380641)
Affinity DataIC50:  1nM. Assay description: Inhibition of mouse recombinant 11beta-HSD1 by scintillation proximity assay
In DepthDetails ArticlePubMed