BDBM50434656 CHEMBL2387463
SMILES Fc1ccccc1-c1cnc2[nH]cc(NC(=O)c3cnn4ccc(NCC5CCNCC5)nc34)c2c1
InChI Key InChIKey=UCLIZEJSCGLLJP-UHFFFAOYSA-N
Data  3 KI
  Tab Delimited (TSV)   2D SDfile   Computed 3D by Vconf -m prep SDfile
Find this compound or compounds like it in BindingDB:
Activity Spreadsheet -- Enzyme Inhibition Constant Data from BindingDB
Found 3 hits for monomerid = 50434656
TargetSerine/threonine-protein kinase pim-1(Homo sapiens (Human))
Genentech
Curated by ChEMBL
LigandPNGBDBM50434656(CHEMBL2387463)
Affinity DataKi:  0.00700nM. Assay description: Inhibition of PIM1 (unknown origin) using FAM-pimtide as substrate after 90 mins by spectrophotometry in presence of ATP
In DepthDetails ArticlePubMed
TargetSerine/threonine-protein kinase pim-3(Homo sapiens (Human))
Genentech
Curated by ChEMBL
LigandPNGBDBM50434656(CHEMBL2387463)
Affinity DataKi:  0.0220nM. Assay description: Inhibition of PIM3 (unknown origin) using FAM-pimtide as substrate after 90 mins by spectrophotometry in presence of ATP
In DepthDetails ArticlePubMed
TargetSerine/threonine-protein kinase pim-2(Homo sapiens (Human))
Genentech
Curated by ChEMBL
LigandPNGBDBM50434656(CHEMBL2387463)
Affinity DataKi:  0.0940nM. Assay description: Inhibition of PIM2 (unknown origin) using FAM-pimtide as substrate after 90 mins by spectrophotometry in presence of ATP
In DepthDetails ArticlePubMed