BDBM50437797 CHEMBL2407184
SMILES ON(CCC(c1ccc(Cl)c(Cl)c1)P(O)(O)=O)C(=O)c1ccccc1
InChI Key InChIKey=ZQCVCGYWPNFEAH-UHFFFAOYSA-N
Data  1 IC50  1 Kd
PDB links: 2 PDB IDs match this monomer.
  Tab Delimited (TSV)   2D SDfile   Computed 3D by Vconf -m prep SDfile
Find this compound or compounds like it in BindingDB:
Activity Spreadsheet -- Enzyme Inhibition Constant Data from BindingDB
Found 2 hits for monomerid = 50437797
Target1-deoxy-D-xylulose 5-phosphate reductoisomerase(Mycobacterium tuberculosis)
Uppsala University
Curated by ChEMBL
LigandPNGBDBM50437797(CHEMBL2407184)
Affinity DataIC50:  320nM. Assay description: Inhibition of Mycobacterium tuberculosis DXR using DXP as substrate measured every 5 secs for 250 secs in presence of NADPH
Target1-deoxy-D-xylulose 5-phosphate reductoisomerase(Mycobacterium tuberculosis)
Uppsala University
Curated by ChEMBL
LigandPNGBDBM50437797(CHEMBL2407184)
Affinity DataKd:  210nM. Assay description: Binding affinity to Mycobacterium tuberculosis DXR assessed as dissociation constant by spectrofluorimetric analysis in presence of NADPH and MnCl2