BDBM50438986 CHEMBL2419503
SMILES O=C(NCc1ccc(cc1)S(=O)(=O)c1ccccc1)c1cc2cnccc2[nH]1
InChI Key InChIKey=LGQSNALVWIMFPP-UHFFFAOYSA-N
Data  3 IC50
PDB links: 1 PDB ID matches this monomer.
  Tab Delimited (TSV)   2D SDfile   Computed 3D by Vconf -m prep SDfile
Find this compound or compounds like it in BindingDB:
Activity Spreadsheet -- Enzyme Inhibition Constant Data from BindingDB
Found 3 hits for monomerid = 50438986
TargetNicotinamide phosphoribosyltransferase(Homo sapiens (Human))
Genentech
Curated by ChEMBL
LigandPNGBDBM50438986(CHEMBL2419503)
Affinity DataIC50:  20nM. Assay description: Inhibition of human NAMPT using NAM/PRPP as substrate incubated for 15 mins prior to substrate addition measured after 30 mins by mass spectrometric ...
TargetNicotinamide phosphoribosyltransferase(Homo sapiens (Human))
Genentech
Curated by ChEMBL
LigandPNGBDBM50438986(CHEMBL2419503)
Affinity DataIC50:  29nM. Assay description: Inhibition of Nampt (unknown origin) using nicotinamide as substrate preincubated for 15 mins measured after 30 mins by mass spectrometry analysis
TargetNicotinamide phosphoribosyltransferase(Homo sapiens (Human))
Genentech
Curated by ChEMBL
LigandPNGBDBM50438986(CHEMBL2419503)
Affinity DataIC50:  29nM. Assay description: Inhibition of C-terminal His-tagged NAMPT (unknown origin) expressed in Escherichia coli BL21 using nicotinamide as substrate preincubated for 15 min...