BDBM50440625 CHEMBL2426549
SMILES CCc1cc(=O)oc2cc(Oc3ccc(Cl)cc3O)ccc12
InChI Key InChIKey=DLJFLRQDOOKMOE-UHFFFAOYSA-N
Data  2 IC50
  Tab Delimited (TSV)   2D SDfile   Computed 3D by Vconf -m prep SDfile
Find this compound or compounds like it in BindingDB:
Activity Spreadsheet -- Enzyme Inhibition Constant Data from BindingDB
Found 2 hits for monomerid = 50440625
Target3-oxoacyl-[acyl-carrier-protein] reductase(Plasmodium falciparum (isolate 3D7))
University Of Bologna
Curated by ChEMBL
LigandPNGBDBM50440625(CHEMBL2426549)
Affinity DataIC50: >1.00E+5nM. Assay description: Inhibition of recombinant Plasmodium falciparum 3D7 FabG using acetoacetyl-CoA as substrate after 10 mins in presence of NADPH
In DepthDetails ArticlePubMed
Target3-hydroxyacyl-[acyl-carrier-protein] dehydratase(Plasmodium falciparum)
University Of Bologna
Curated by ChEMBL
LigandPNGBDBM50440625(CHEMBL2426549)
Affinity DataIC50: >1.00E+5nM. Assay description: Inhibition of recombinant Plasmodium falciparum FabZ using crotonoyl-CoA as substrate after 10 mins
In DepthDetails ArticlePubMed