BDBM50443020 CHEMBL3087501
SMILES CC(C)N(CCCNC(=O)Nc1ccc(cc1)C(C)(C)C)C[C@@H]1C[C@H]([C@H](O)[C@@H]1O)n1cnc2c(N)ncnc12
InChI Key InChIKey=RHXRYVGFCIUCNP-DAQNBYSMSA-N
Data  5 KI
  Tab Delimited (TSV)   2D SDfile   Computed 3D by Vconf -m prep SDfile
Find this compound or compounds like it in BindingDB:
Activity Spreadsheet -- Enzyme Inhibition Constant Data from BindingDB
Found 5 hits for monomerid = 50443020
TargetHistone-lysine N-methyltransferase, H3 lysine-79 specific(Homo sapiens (Human))
Baylor College Of Medicine
Curated by ChEMBL
LigandPNGBDBM50443020(CHEMBL3087501)
Affinity DataKi: >5.00E+4nM. Assay description: Competitive inhibition of recombinant human DOT1L using adenosine/deazaadenosine as substrate and SAM cofactor
In DepthDetails ArticlePubMed
TargetHistone-lysine N-methyltransferase SUV39H1(Homo sapiens (Human))
Baylor College Of Medicine
Curated by ChEMBL
LigandPNGBDBM50443020(CHEMBL3087501)
Affinity DataKi: >5.00E+4nM. Assay description: Inhibition of SUV39H1 (unknown origin)
In DepthDetails ArticlePubMed
TargetHistone-lysine N-methyltransferase, H3 lysine-79 specific(Homo sapiens (Human))
Baylor College Of Medicine
Curated by ChEMBL
LigandPNGBDBM50443020(CHEMBL3087501)
Affinity DataKi: >5.00E+4nM. Assay description: Inhibition of human recombinant DOT1L (catalytic domain 1 to 472) using [3H]-SAM by scintillation containing
In DepthDetails ArticlePubMed
TargetProtein arginine N-methyltransferase 1(Homo sapiens)
Baylor College Of Medicine
Curated by ChEMBL
LigandPNGBDBM50443020(CHEMBL3087501)
Affinity DataKi: >5.00E+4nM. Assay description: Inhibition of PRMT1 (unknown origin)
In DepthDetails ArticlePubMed
TargetHistone-arginine methyltransferase CARM1(Homo sapiens (Human))
Baylor College Of Medicine
Curated by ChEMBL
LigandPNGBDBM50443020(CHEMBL3087501)
Affinity DataKi: >5.00E+4nM. Assay description: Inhibition of CARM1 (unknown origin)
In DepthDetails ArticlePubMed