BDBM50444464 CHEMBL192046
SMILES C[C@@]12OC(=O)[C@@]1(NC(=O)[C@@H]2CCCl)[C@@H](O)C1CCCCC1
InChI Key InChIKey=OJZFVOGTYOBPKD-GVARAGBVSA-N
Data  1 IC50  1 EC50
  Tab Delimited (TSV)   2D SDfile   Computed 3D by Vconf -m prep SDfile
Find this compound or compounds like it in BindingDB:
Activity Spreadsheet -- Enzyme Inhibition Constant Data from BindingDB
Found 2 hits for monomerid = 50444464
TargetProteasome subunit beta type-5(Homo sapiens (Human))
The Pennsylvania State University
Curated by ChEMBL
LigandPNGBDBM50444464(CHEMBL192046)
Affinity DataIC50:  23nM. Assay description: Inhibition of chymotrypsin like activity of human 20S proteasome after 1 hr by luminescence assay
In DepthDetails ArticlePubMed
TargetProteasome subunit beta type-5(Homo sapiens (Human))
The Pennsylvania State University
Curated by ChEMBL
LigandPNGBDBM50444464(CHEMBL192046)
Affinity DataEC50:  10nM. Assay description: Inhibition of chymotrypsin like activity of 20S proteasome in HEK293 cells after 24 hrs by microscopic analysis
In DepthDetails ArticlePubMed