BDBM50444688 CHEMBL3098810
SMILES NC(=O)c1cc2c(N)ncc(C(N)=O)c2s1
InChI Key InChIKey=VOGMWPBBHVVUAW-UHFFFAOYSA-N
Data  1 IC50
PDB links: 1 PDB ID matches this monomer.
  Tab Delimited (TSV)   2D SDfile   Computed 3D by Vconf -m prep SDfile
Find this compound or compounds like it in BindingDB:
Activity Spreadsheet -- Enzyme Inhibition Constant Data from BindingDB
Found 1 hit for monomerid = 50444688
TargetDNA ligase(Staphylococcus aureus)
Astrazeneca
Curated by ChEMBL
LigandPNGBDBM50444688(CHEMBL3098810)
Affinity DataIC50:  1.50E+4nM. Assay description: Inhibition of Staphylococcus aureus LigA
In DepthDetails ArticlePubMed