BDBM50444924 CHEMBL3099747
SMILES OC(=O)[C@H](Cc1ccc(O)cc1)NC(=O)c1cc(C(O)=O)c2cc(ccc2n1)-c1cccc(c1)C(F)(F)F
InChI Key InChIKey=UKCWILSNXVOZQS-QHCPKHFHSA-N
Data  1 KI  1 IC50  1 Kd
  Tab Delimited (TSV)   2D SDfile   Computed 3D by Vconf -m prep SDfile
Find this compound or compounds like it in BindingDB:
Activity Spreadsheet -- Enzyme Inhibition Constant Data from BindingDB
Found 3 hits for monomerid = 50444924
TargetCyclin-dependent kinase 2(Homo sapiens (Human))
Merck Research Laboratories
Curated by ChEMBL
LigandPNGBDBM50444924(CHEMBL3099747)
Affinity DataKi:  1.20E+4nM. Assay description: Displacement of B-Alexa-Fluor647 from CDK2 (unknown origin) by fluorescence polarization assay
In DepthDetails ArticlePubMed
TargetCyclin-dependent kinase 2(Homo sapiens (Human))
Merck Research Laboratories
Curated by ChEMBL
LigandPNGBDBM50444924(CHEMBL3099747)
Affinity DataKd: >1.00E+4nM. Assay description: Binding affinity to CDK2 (unknown origin) at 20 to 80 degC by circular dichroism analysis
In DepthDetails ArticlePubMed
TargetCyclin-dependent kinase 2(Homo sapiens (Human))
Merck Research Laboratories
Curated by ChEMBL
LigandPNGBDBM50444924(CHEMBL3099747)
Affinity DataIC50: >1.00E+4nMT: 2°C. Assay description: Inhibition of CDK2 (unknown origin)-cyclin A interaction preincubated for 30 mins at room temperature followed by incubation at 40 degC for 30 mins b...
In DepthDetails ArticlePubMed