BDBM50446126 CHEMBL3108833
SMILES Cc1cc(NS(=O)(=O)CCNC(=O)Cc2ccc(Cl)c(Cl)c2)no1
InChI Key InChIKey=TZSMCCAKJZATDX-UHFFFAOYSA-N
Data  2 IC50
  Tab Delimited (TSV)   2D SDfile   Computed 3D by Vconf -m prep SDfile
Find this compound or compounds like it in BindingDB:
Activity Spreadsheet -- Enzyme Inhibition Constant Data from BindingDB
Found 2 hits for monomerid = 50446126
TargetATP-dependent 6-phosphofructokinase(Trypanosoma brucei)
National Center For Advancing Translational Sciences
Curated by ChEMBL
LigandPNGBDBM50446126(CHEMBL3108833)
Affinity DataIC50:  3.26E+4nM. Assay description: Inhibition of Trypanosoma brucei PFK-mediated ADP production using ATP/fructose-6-phosphate as substrate by luciferase based luminescence assay
In DepthDetails ArticlePubMed
TargetATP-dependent 6-phosphofructokinase(Trypanosoma cruzi)
National Center For Advancing Translational Sciences
Curated by ChEMBL
LigandPNGBDBM50446126(CHEMBL3108833)
Affinity DataIC50:  1.63E+4nM. Assay description: Inhibition of Trypanosoma cruzi PFK
In DepthDetails ArticlePubMed