BDBM50446138 CHEMBL3108881
SMILES Cc1cc(CC(=O)N2C[C@H](O)C[C@H]2C(=O)NCc2ccc(cc2)-c2cnco2)on1
InChI Key InChIKey=HFCLIEBJTGJKSV-AEFFLSMTSA-N
Data  3 IC50  2 Kd
PDB links: 1 PDB ID matches this monomer.
  Tab Delimited (TSV)   2D SDfile   Computed 3D by Vconf -m prep SDfile
Find this compound or compounds like it in BindingDB:
Activity Spreadsheet -- Enzyme Inhibition Constant Data from BindingDB
Found 5 hits for monomerid = 50446138
TargetElongin-C(Homo sapiens (Human))
University Of Utah
Curated by ChEMBL
LigandPNGBDBM50446138(CHEMBL3108881)
Affinity DataIC50:  4.10E+3nM. Assay description: Displacement of FAM-DEALAHyp-YIPD from 6xHis-tagged VHL (1 to 213)/elongins-B/elonginC (unknown origin) expressed in Escherichia coli BL21 after 1 mi...
Targetvon Hippel-Lindau disease tumor suppressor(Homo sapiens (Human))
University Of Dundee
Curated by ChEMBL
LigandPNGBDBM50446138(CHEMBL3108881)
Affinity DataKd:  5.30E+3nM. Assay description: Binding affinity to N-terminal His6-tagged pVHL (54 to 213 amino acids) (unknown origin) expressed in Escherichia coli BL21 (DE3) by isothermal titra...
Targetvon Hippel-Lindau disease tumor suppressor(Homo sapiens (Human))
University Of Dundee
Curated by ChEMBL
LigandPNGBDBM50446138(CHEMBL3108881)
Affinity DataIC50:  4.10E+3nM. Assay description: Inhibition of VHL (unknown origin) by fluorescence polarization assay
Targetvon Hippel-Lindau disease tumor suppressor(Homo sapiens (Human))
University Of Dundee
Curated by ChEMBL
LigandPNGBDBM50446138(CHEMBL3108881)
Affinity DataIC50:  4.10E+3nM. Assay description: Inhibition of 6xHis-tagged VHL (unknown origin) expressed in Escherichia coli BL21 cells by fluorescence polarization assay
Targetvon Hippel-Lindau disease tumor suppressor(Homo sapiens (Human))
University Of Dundee
Curated by ChEMBL
LigandPNGBDBM50446138(CHEMBL3108881)
Affinity DataKd:  5.50E+3nM. Assay description: Displacement of 19-mer HIF-1alpha peptide from VHL (unknown origin) by isothermal titration calorimetry analysis