BDBM50447297 CHEMBL3114210
SMILES CCNC(=O)Nc1nc2cc(-c3ccn4ncnc4c3)c(=O)n(C(C)C)c2s1
InChI Key InChIKey=YEDSLFIZDGXUKE-UHFFFAOYSA-N
Data  1 IC50
  Tab Delimited (TSV)   2D SDfile   Computed 3D by Vconf -m prep SDfile
Find this compound or compounds like it in BindingDB:
Activity Spreadsheet -- Enzyme Inhibition Constant Data from BindingDB
Found 1 hit for monomerid = 50447297
TargetDNA gyrase subunit B(Mycobacterium smegmatis)
Astrazeneca
Curated by ChEMBL
LigandPNGBDBM50447297(CHEMBL3114210)
Affinity DataIC50:  8nM. Assay description: Inhibition of Mycobacterium smegmatis DNA gyrase B ATPase activity after 100 mins
In DepthDetails ArticlePubMed