BDBM50447839 CHEMBL565088
SMILES Cc1cc(O)c(cc1-c1ccc2cc(ccc2c1Cl)C(O)=O)C12CC3CC(CC(C3)C1)C2
InChI Key InChIKey=SYUOCBXUKIKKCJ-UHFFFAOYSA-N
Data  1 IC50
  Tab Delimited (TSV)   2D SDfile   Computed 3D by Vconf -m prep SDfile
Find this compound or compounds like it in BindingDB:
Activity Spreadsheet -- Enzyme Inhibition Constant Data from BindingDB
Found 1 hit for monomerid = 50447839
TargetInhibitor of nuclear factor kappa-B kinase subunit beta(Homo sapiens (Human))
Universidade De Vigo
Curated by ChEMBL
LigandPNGBDBM50447839(CHEMBL565088)
Affinity DataIC50:  4.75E+3nM. Assay description: Inhibition of recombinant IKKbeta (unknown origin) using ulight-IkappaomegaBalpha as substrate after 2 hrs by LANCE ultra TR-FRET assay
In DepthDetails ArticlePubMed