BDBM50449257 CHEMBL3125327
SMILES CCC1(CC(=NO1)c1ccc2c(c1)nc(CCCCC(O)=O)n(-c1ccc(F)cc1)c2=O)c1ccccc1
InChI Key InChIKey=RLQULLBVISOPQL-UHFFFAOYSA-N
Data  1 KI  1 IC50
  Tab Delimited (TSV)   2D SDfile   Computed 3D by Vconf -m prep SDfile
Find this compound or compounds like it in BindingDB:
Activity Spreadsheet -- Enzyme Inhibition Constant Data from BindingDB
Found 2 hits for monomerid = 50449257
TargetProstaglandin D2 receptor 2(Homo sapiens (Human))
Merck Research Laboratories
Curated by ChEMBL
LigandPNGBDBM50449257(CHEMBL3125327)
Affinity DataKi:  1.80nM. Assay description: Antagonist activity at human CRTH2 receptor expressed in CHO-1 cells assessed as inhibition of PGD2-induced Ca2+ flux preincubated for 30 mins follow...
In DepthDetails ArticlePubMed
TargetProstaglandin D2 receptor 2(Homo sapiens (Human))
Merck Research Laboratories
Curated by ChEMBL
LigandPNGBDBM50449257(CHEMBL3125327)
Affinity DataIC50:  39nM. Assay description: Antagonist activity at human CRTH2 receptor expressed in HEK cells assessed as inhibition of forskolin-induced cAMP formation preincubated for 10 min...
In DepthDetails ArticlePubMed