BDBM50449279 CHEMBL3125162
SMILES C[C@]1(Cc2ccccc2)CC(=NO1)c1ccc2c(c1)nc(CCCCC(O)=O)n(-c1ccc(F)cc1)c2=O
InChI Key InChIKey=YTAUKHWHPMKCFO-PMERELPUSA-N
Data  1 KI  1 IC50
  Tab Delimited (TSV)   2D SDfile   Computed 3D by Vconf -m prep SDfile
Find this compound or compounds like it in BindingDB:
Activity Spreadsheet -- Enzyme Inhibition Constant Data from BindingDB
Found 2 hits for monomerid = 50449279
TargetProstaglandin D2 receptor 2(Homo sapiens (Human))
Merck Research Laboratories
Curated by ChEMBL
LigandPNGBDBM50449279(CHEMBL3125162)
Affinity DataKi:  7.40nM. Assay description: Antagonist activity at human CRTH2 receptor expressed in CHO-1 cells assessed as inhibition of PGD2-induced Ca2+ flux preincubated for 30 mins follow...
In DepthDetails ArticlePubMed
TargetProstaglandin D2 receptor 2(Homo sapiens (Human))
Merck Research Laboratories
Curated by ChEMBL
LigandPNGBDBM50449279(CHEMBL3125162)
Affinity DataIC50:  14nM. Assay description: Antagonist activity at human CRTH2 receptor expressed in HEK cells assessed as inhibition of forskolin-induced cAMP formation preincubated for 10 min...
In DepthDetails ArticlePubMed