BDBM50450008 CHEMBL4166077
SMILES Clc1ccc(s1)S(=O)(=O)Nc1ccc(cc1)-c1nc2cc(NS(=O)(=O)c3ccc(Cl)c(Cl)c3)ccc2o1
InChI Key InChIKey=ORZXORNJEQILRH-UHFFFAOYSA-N
Data  8 IC50
  Tab Delimited (TSV)   2D SDfile   Computed 3D by Vconf -m prep SDfile
Find this compound or compounds like it in BindingDB:
Activity Spreadsheet -- Enzyme Inhibition Constant Data from BindingDB
Found 8 hits for monomerid = 50450008
Target60 kDa heat shock protein, mitochondrial(Homo sapiens)
Indiana University School Of Medicine
Curated by ChEMBL
LigandPNGBDBM50450008(CHEMBL4166077)
Affinity DataIC50:  4.70E+3nM. Assay description: Inhibition of human N-terminal octa-His-tagged HSP60 expressed in Escherichia coli Rosetta(DE3) pLysS/human HSP10 expressed in Escherichia coli Roset...
Ligand InfoPC cidPC sid
In DepthDetails ArticlePubMed
TargetThiosulfate sulfurtransferase(Homo sapiens)
Indiana University School Of Medicine
Curated by ChEMBL
LigandPNGBDBM50450008(CHEMBL4166077)
Affinity DataIC50: >1.00E+5nM. Assay description: Inhibition of refolded rhodanese (unknown origin) preincubated with Escherichia coli GroEL/GroES for 60 mins by measuring MDH enzyme activity using s...
Ligand InfoPC cidPC sid
In DepthDetails ArticlePubMed
TargetCo-chaperonin GroES(Escherichia coli)
Indiana University School Of Medicine
Curated by ChEMBL
LigandPNGBDBM50450008(CHEMBL4166077)
Affinity DataIC50:  5.10E+3nM. Assay description: Inhibition of Escherichia coli GroEL expressed in Escherichia coliDH5alpha/Escherichia coli GroES expressed in Escherichia coli BL21 (DE3) assessed a...
Ligand InfoPC cidPC sid
In DepthDetails ArticlePubMed
TargetTyrosine-protein phosphatase non-receptor type 1(Homo sapiens (Human))
Indiana University School Of Medicine
Curated by ChEMBL
LigandPNGBDBM50450008(CHEMBL4166077)
Affinity DataIC50:  7.60E+3nM. Assay description: Inhibition of human PTPN1 expressed in Escherichia coli Rosetta 2 (DE3) using pNPP as substrate after 45 mins by spectrophotometric method
Ligand InfoPC cidPC sid
In DepthDetails ArticlePubMed
TargetTyrosine-protein phosphatase non-receptor type 2(Homo sapiens (Human))
Indiana University School Of Medicine
Curated by ChEMBL
LigandPNGBDBM50450008(CHEMBL4166077)
Affinity DataIC50:  1.30E+4nM. Assay description: Inhibition of human PTPN2 expressed in Escherichia coli Rosetta 2 (DE3) using pNPP as substrate after 45 mins by spectrophotometric method
Ligand InfoPC cidPC sid
In DepthDetails ArticlePubMed
TargetTyrosine-protein phosphatase non-receptor type 5(Homo sapiens (Human))
Indiana University School Of Medicine
Curated by ChEMBL
LigandPNGBDBM50450008(CHEMBL4166077)
Affinity DataIC50:  1.10E+4nM. Assay description: Inhibition of human PTPN5 expressed in Escherichia coli Rosetta 2 (DE3) using pNPP as substrate after 45 mins by spectrophotometric method
Ligand InfoPC cidPC sid
In DepthDetails ArticlePubMed
TargetTYR_PHOSPHATASE_2 domain-containing protein(Mycobacterium tuberculosis)
Indiana University School Of Medicine
Curated by ChEMBL
LigandPNGBDBM50450008(CHEMBL4166077)
Affinity DataIC50:  3.30E+3nM. Assay description: Inhibition of Mycobacterium tuberculosis His-tagged PtpB expressed in Escherichia coli Rosetta 2 (DE3) using pNPP as substrate after 30 mins by spect...
Ligand InfoPC cidPC sid
In DepthDetails ArticlePubMed
TargetCo-chaperonin GroES(Escherichia coli)
Indiana University School Of Medicine
Curated by ChEMBL
LigandPNGBDBM50450008(CHEMBL4166077)
Affinity DataIC50:  6.40E+3nM. Assay description: Inhibition of Escherichia coli GroEL expressed in Escherichia coli DH5alpha/Escherichia coli GroES expressed in Escherichia coli BL21 (DE3) assessed ...
Ligand InfoPC cidPC sid
In DepthDetails ArticlePubMed