BDBM50450348 CHEMBL51282
SMILES CN(C)c1ccc(cc1)-c1nc(SCCOCCSc2nc(c([nH]2)-c2ccc(cc2)N(C)C)-c2ccc(cc2)N(C)C)[nH]c1-c1ccc(cc1)N(C)C
InChI Key InChIKey=HJJOFLCUKHYIDF-UHFFFAOYSA-N
Data  2 IC50
  Tab Delimited (TSV)   2D SDfile   Computed 3D by Vconf -m prep SDfile
Find this compound or compounds like it in BindingDB:
Activity Spreadsheet -- Enzyme Inhibition Constant Data from BindingDB
Found 2 hits for monomerid = 50450348
TargetSterol O-acyltransferase 1(Mus musculus)
Dupont Pharmaceuticals
Curated by ChEMBL
LigandPNGBDBM50450348(CHEMBL51282)
Affinity DataIC50:  370nM. Assay description: Inhibition of Acyl coenzyme A:cholesterol acyltransferase (ACAT) in J774 Macrophage cell culture
In DepthDetails
TargetSterol O-acyltransferase 1(Rattus norvegicus)
Dupont Pharmaceuticals
Curated by ChEMBL
LigandPNGBDBM50450348(CHEMBL51282)
Affinity DataIC50:  134nM. Assay description: In vitro inhibition of Acyl coenzyme A:cholesterol acyltransferase (ACAT) in rat hepatic microsomes
In DepthDetails