BDBM50450842 CHEMBL4213805
SMILES Cc1n[nH]cc1-c1cc2N[C@]3(CC[C@](O)(CC3)c3ccc(F)cc3)NC(=O)c2s1
InChI Key InChIKey=NCRZDERILSVITP-OYRHEFFESA-N
Data  4 IC50
  Tab Delimited (TSV)   2D SDfile   Computed 3D by Vconf -m prep SDfile
Find this compound or compounds like it in BindingDB:
Activity Spreadsheet -- Enzyme Inhibition Constant Data from BindingDB
Found 4 hits for monomerid = 50450842
TargetCell division cycle 7-related protein kinase(Homo sapiens (Human))
Takeda Pharmaceutical
Curated by ChEMBL
LigandPNGBDBM50450842(CHEMBL4213805)
Affinity DataIC50: >1.00E+3nM. Assay description: Inhibition of Cdc7 in human HeLa cells assessed as reduction in MCM2 phosphorylation at ser40 residues after 7 hrs by Western blot analysis
Ligand InfoPC cidPC sid
In DepthDetails ArticlePubMed
TargetCyclin-dependent kinase 2/G1/S-specific cyclin-E1(Homo sapiens (Human))
Takeda Pharmaceutical
Curated by ChEMBL
LigandPNGBDBM50450842(CHEMBL4213805)
Affinity DataIC50:  960nM. Assay description: Inhibition of recombinant human Cdk2 (1 to 298 residues)/human N-terminal GST-tagged cyclinE (1 to 410 residues) expressed in baculovirus expression ...
Ligand InfoPC cidPC sid
In DepthDetails ArticlePubMed
TargetRho-associated protein kinase 1(Homo sapiens (Human))
Takeda Pharmaceutical
Curated by ChEMBL
LigandPNGBDBM50450842(CHEMBL4213805)
Affinity DataIC50:  820nM. Assay description: Inhibition of recombinant human N-terminal GST-tagged ROCK1 (1 to 477 residues) expressed in baculovirus expression system using biotin-STK substrate...
Ligand InfoPC cidPC sid
In DepthDetails ArticlePubMed
TargetCell division cycle 7-related protein kinase/Protein DBF4 homolog A(Homo sapiens (Human))
Takeda Pharmaceutical
Curated by ChEMBL
LigandPNGBDBM50450842(CHEMBL4213805)
Affinity DataIC50:  1.20nM. Assay description: Inhibition of recombinant human Cdc7 (1 to 574 residues)/human N-terminal GST-tagged DBF4 (1 to 674 residues) expressed in baculovirus expression sys...
Ligand InfoPC cidPC sid
In DepthDetails ArticlePubMed