BDBM50452200 CHEMBL4212416::US10647727, Example 20
SMILES Cc1nc(NC2(CC2)c2ccc(cc2)C(F)(F)F)c2cnn(C)c2n1
InChI Key InChIKey=XBYSLZZQMIGOEQ-UHFFFAOYSA-N
Data  4 KI
  Tab Delimited (TSV)   2D SDfile   Computed 3D by Vconf -m prep SDfile
Find this compound or compounds like it in BindingDB:
Activity Spreadsheet -- Enzyme Inhibition Constant Data from BindingDB
Found 4 hits for monomerid = 50452200
TargetcGMP-dependent 3',5'-cyclic phosphodiesterase(Homo sapiens (Human))
Merck
Curated by ChEMBL
LigandPNGBDBM50452200(CHEMBL4212416 | US10647727, Example 20)
Affinity DataKi:  5.5nM. Assay description: Binding affinity to PDE2 (unknown origin) by SPR analysis
Ligand InfoPC cidPC sid
In DepthDetails ArticlePubMed
TargetPhosphodiesterase(Macaca mulatta (Rhesus macaque))
Merck Sharp & Dohme
US Patent
LigandPNGBDBM50452200(CHEMBL4212416 | US10647727, Example 20)
Affinity DataKi:  5.5nM. Assay description: In a typical experiment the PDE2 inhibitory activity of the compounds of the present invention was determined in accordance with the following experi...
Ligand InfoPC cidPC sid
In DepthDetails US Patent
TargetcGMP-dependent 3',5'-cyclic phosphodiesterase(Homo sapiens (Human))
Merck
Curated by ChEMBL
LigandPNGBDBM50452200(CHEMBL4212416 | US10647727, Example 20)
Affinity DataKi:  6.10nM. Assay description: In a typical experiment the PDE2 inhibitory activity of the compounds of the present invention was determined in accordance with the following experi...
Ligand InfoPC cidPC sid
In DepthDetails US Patent
TargetcGMP-dependent 3',5'-cyclic phosphodiesterase(Homo sapiens (Human))
Merck
Curated by ChEMBL
LigandPNGBDBM50452200(CHEMBL4212416 | US10647727, Example 20)
Affinity DataKi:  8.40nM. Assay description: In a typical experiment the PDE2 inhibitory activity of the compounds of the present invention was determined in accordance with the following experi...
Ligand InfoPC cidPC sid
In DepthDetails US Patent