BDBM50452574 CHEMBL2112183
SMILES [H][C@]12CC[C@]([H])(C1)C(C2)Nc1ncnc2n(cnc12)[C@@H]1O[C@H](CO)[C@@H](O)[C@H]1O
InChI Key InChIKey=YKPCEENRZZBDMC-MIACGEQZSA-N
Data  2 KI
  Tab Delimited (TSV)   2D SDfile   Computed 3D by Vconf -m prep SDfile
Find this compound or compounds like it in BindingDB:
Activity Spreadsheet -- Enzyme Inhibition Constant Data from BindingDB
Found 2 hits for monomerid = 50452574
TargetAdenosine receptor A1(Rattus norvegicus (rat))
Warner-Lambert
Curated by ChEMBL
LigandPNGBDBM50452574(CHEMBL2112183)
Affinity DataKi:  0.910nM. Assay description: Binding affinity against Adenosine A1 receptor using [3H]CHA in rat brain membranes
In DepthDetails ArticlePubMed
TargetAdenosine receptor A2a/A2b(Rattus norvegicus)
Warner-Lambert
Curated by ChEMBL
LigandPNGBDBM50452574(CHEMBL2112183)
Affinity DataKi:  970nM. Assay description: Binding affinity against Adenosine A2 receptor using [3H]NECA with 50 nM CPA in rat striatal brain membranes
In DepthDetails ArticlePubMed