BDBM50453350 CHEMBL2113482
SMILES CCNC(=O)[C@H]1O[C@H]([C@H](O)[C@@H]1O)n1cnc2c(N)nc(nc12)C#CCN(C)C
InChI Key InChIKey=ARGPRNRTJXPHOZ-PFHKOEEOSA-N
Data  1 KI  1 EC50
  Tab Delimited (TSV)   2D SDfile   Computed 3D by Vconf -m prep SDfile
Find this compound or compounds like it in BindingDB:
Activity Spreadsheet -- Enzyme Inhibition Constant Data from BindingDB
Found 2 hits for monomerid = 50453350
TargetAdenosine receptor A1(Rattus norvegicus (rat))
Universit£
Curated by ChEMBL
LigandPNGBDBM50453350(CHEMBL2113482)
Affinity DataKi:  28nM. Assay description: Affinity for adenosine A1 receptor assayed in a competition assay in rat brain using [3H]-CHA as radioligand
In DepthDetails ArticlePubMed
TargetAdenosine receptor A1(Rattus norvegicus (rat))
Universit£
Curated by ChEMBL
LigandPNGBDBM50453350(CHEMBL2113482)
Affinity DataEC50:  332nM. Assay description: Negative chronotropic activity via A1 Adenosine receptor was tested in spontaneously beating rat atria
In DepthDetails ArticlePubMed