BDBM50453514 CHEMBL4214868
SMILES COC(=O)CN1C[C@H](Cc2ccc(Cl)cc2)N(C[C@@H]1C)C1CCN(CC1)c1n[nH]c(N)n1
InChI Key InChIKey=QMFQFIWQIFUCEU-KXBFYZLASA-N
Data  2 IC50
  Tab Delimited (TSV)   2D SDfile   Computed 3D by Vconf -m prep SDfile
Find this compound or compounds like it in BindingDB:
Activity Spreadsheet -- Enzyme Inhibition Constant Data from BindingDB
Found 2 hits for monomerid = 50453514
TargetChitotriosidase-1(Mus musculus)TBA
LigandPNGBDBM50453514(CHEMBL4214868)
Affinity DataIC50:  29nM. Assay description: Inhibition of mouse CHIT1 using 4-methylumbelliferyl beta-D-N,N',N'' triacetylchitotrioside as substrate measured after 60 mins by fluorometric metho...
Ligand InfoPC cidPC sid
In DepthDetails ArticlePubMed
TargetAcidic mammalian chitinase(Mus musculus)TBA
LigandPNGBDBM50453514(CHEMBL4214868)
Affinity DataIC50:  231nM. Assay description: Inhibition of mouse AMCase using 4-methylumbelliferyl beta-D-N,N' diacetylchitobioside hydrate as substrate measured after 60 mins by fluorometric me...
Ligand InfoPC cidPC sid
In DepthDetails ArticlePubMed