BDBM50453674 CHEMBL2113703
SMILES CNC(=O)[C@@H]1C[C@@H](O)[C@@H](O1)n1cnc2c(NCc3cccc(I)c3)nc(Cl)nc12
InChI Key InChIKey=FXEWFFAHNPVFJE-BWACUDIHSA-N
Data  3 KI
  Tab Delimited (TSV)   2D SDfile   Computed 3D by Vconf -m prep SDfile
Find this compound or compounds like it in BindingDB:
Activity Spreadsheet -- Enzyme Inhibition Constant Data from BindingDB
Found 3 hits for monomerid = 50453674
TargetAdenosine receptor A3(Rattus norvegicus)
National Institute Of Diabetes
Curated by ChEMBL
LigandPNGBDBM50453674(CHEMBL2113703)
Affinity DataKi:  33nM. Assay description: Binding affinity against adenosine A3 receptor from rat brain.
In DepthDetails ArticlePubMed
TargetAdenosine receptor A1(Rattus norvegicus (rat))
National Institute Of Diabetes
Curated by ChEMBL
LigandPNGBDBM50453674(CHEMBL2113703)
Affinity DataKi:  1.03E+3nM. Assay description: Binding affinity against adenosine A1 receptor from rat brain.
In DepthDetails ArticlePubMed
TargetAdenosine receptor A2a(Rattus norvegicus (rat))
National Institute Of Diabetes
Curated by ChEMBL
LigandPNGBDBM50453674(CHEMBL2113703)
Affinity DataKi:  4.66E+3nM. Assay description: Binding affinity against adenosine A2A receptor from rat brain.
In DepthDetails ArticlePubMed