BDBM50455523 CHEMBL4215606
SMILES CCCN1C(=O)N=C2N=C(N=C2C1=O)c1ccc(cc1)S(=O)(=O)N1CCN(Cc2ccc(Cl)cc2)CC1
InChI Key InChIKey=XWDZXZVRFAGMGA-UHFFFAOYSA-N
Data  1 IC50
  Tab Delimited (TSV)   2D SDfile   Computed 3D by Vconf -m prep SDfile
Find this compound or compounds like it in BindingDB:
Activity Spreadsheet -- Enzyme Inhibition Constant Data from BindingDB
Found 1 hit for monomerid = 50455523
TargetAdenosine receptor A2b(Homo sapiens (Human))
University Of Bonn
Curated by ChEMBL
LigandPNGBDBM50455523(CHEMBL4215606)
Affinity DataIC50:  1.10nM. Assay description: Displacement of PSB-12105 from recombinant human adenosine A2B receptor expressed in CHO cell membranes preincubated for 30 mins followed by PSB-1210...
Ligand InfoPC cidPC sid
In DepthDetails ArticlePubMed