BDBM50455674 CHEMBL4217240
SMILES COc1ccc(CN(CC(=O)NO)Cc2cccc(c2)C(O)=O)cc1
InChI Key InChIKey=VDAMAZDKFJYVCT-UHFFFAOYSA-N
Data  2 IC50
  Tab Delimited (TSV)   2D SDfile   Computed 3D by Vconf -m prep SDfile
Find this compound or compounds like it in BindingDB:
Activity Spreadsheet -- Enzyme Inhibition Constant Data from BindingDB
Found 2 hits for monomerid = 50455674
TargetMeprin A subunit beta(Homo sapiens)
Fraunhofer Institute For Cell Therapy And Immunology Izi
Curated by ChEMBL
LigandPNGBDBM50455674(CHEMBL4217240)
Affinity DataIC50:  77nM. Assay description: Inhibition of recombinant human meprin beta expressed in yeast using Abz-YVAEAPK(Dnp)G-OH as substrate by fluorescence assay
In DepthDetails ArticlePubMed
TargetMeprin A subunit alpha(Homo sapiens)
Fraunhofer Institute For Cell Therapy And Immunology Izi
Curated by ChEMBL
LigandPNGBDBM50455674(CHEMBL4217240)
Affinity DataIC50:  3.42E+3nM. Assay description: Inhibition of recombinant human meprin alpha expressed in insect cells using Abz-YVADAPK(Dnp)G-OH as substrate by fluorescence assay
In DepthDetails ArticlePubMed