BDBM50456320 CHEMBL4204849
SMILES O=C(C1CC1)N1CCN(CC1)C(=O)c1cnc2ccsc2c1-c1ccc(cc1)C1(CC1)C#N
InChI Key InChIKey=QHKKUEBSRRDZMN-UHFFFAOYSA-N
Data  2 IC50
  Tab Delimited (TSV)   2D SDfile   Computed 3D by Vconf -m prep SDfile
Find this compound or compounds like it in BindingDB:
Activity Spreadsheet -- Enzyme Inhibition Constant Data from BindingDB
Found 2 hits for monomerid = 50456320
TargetAldehyde dehydrogenase 1A1(Homo sapiens (Human))
National Center For Advancing Translational Sciences
Curated by ChEMBL
LigandPNGBDBM50456320(CHEMBL4204849)
Affinity DataIC50:  17nM. Assay description: Inhibition of human ALDH1A1 using NAD+/propionaldehyde as substrate/cofactor preincubated for 15 mins followed by substrate/cofactor addition measure...
Ligand InfoPC cidPC sid
In DepthDetails ArticlePubMed
TargetAldehyde dehydrogenase 1A1(Homo sapiens (Human))
National Center For Advancing Translational Sciences
Curated by ChEMBL
LigandPNGBDBM50456320(CHEMBL4204849)
Affinity DataIC50:  319nM. Assay description: Inhibition of ALDH1A1 in human MIAPaCa2 cells after 30 mins by aldefluor assay
Ligand InfoPC cidPC sid
In DepthDetails ArticlePubMed