BDBM50456587 CHEMBL4209809
SMILES OCc1ccc(cc1)-c1cn(C[C@H]2NC[C@@H](O)[C@H]2O)nn1
InChI Key InChIKey=UVLCRTIAHMWRGK-MCIONIFRSA-N
Data  4 IC50
  Tab Delimited (TSV)   2D SDfile   Computed 3D by Vconf -m prep SDfile
Find this compound or compounds like it in BindingDB:
Activity Spreadsheet -- Enzyme Inhibition Constant Data from BindingDB
Found 4 hits for monomerid = 50456587
TargetAlpha-galactosidase(Coffea arabica (Coffee beans))
University Of Seville
Curated by ChEMBL
LigandPNGBDBM50456587(CHEMBL4209809)
Affinity DataIC50:  1.40E+4nM. Assay description: Inhibition of coffee beans alpha-galactosidase using p-nitrophenyl glycopyranoside preincubated for 5 mins followed by substrate addition measured af...
Ligand InfoPC cidPC sid
In DepthDetails ArticlePubMed
TargetLysosomal acid glucosylceramidase(Homo sapiens (Human))
University Of Seville
Curated by ChEMBL
LigandPNGBDBM50456587(CHEMBL4209809)
Affinity DataIC50:  1.87E+5nM. Assay description: Inhibition of human lysosomal beta-glucocerebrosidase using 4-methylumbelliferyl-beta-D-glucopyranoside as substrate preincubated for 45 mins followe...
Ligand InfoPC cidPC sid
In DepthDetails ArticlePubMed
TargetBeta-galactosidase(Bos taurus (Bovine))
University Of Seville
Curated by ChEMBL
LigandPNGBDBM50456587(CHEMBL4209809)
Affinity DataIC50:  2.68E+5nM. Assay description: Inhibition of bovine liver beta-galactosidase using p-nitrophenyl glycopyranoside preincubated for 5 mins followed by substrate addition measured aft...
Ligand InfoPC cidPC sid
In DepthDetails ArticlePubMed
TargetAlpha-galactosidase A(Homo sapiens (Human))
University Of Seville
Curated by ChEMBL
LigandPNGBDBM50456587(CHEMBL4209809)
Affinity DataIC50:  1.59E+5nM. Assay description: Inhibition of human lysosomal alpha-galactosidase A using 4-methylumbelliferyl-alpha-D-galactopyranoside as substrate preincubated for 45 mins follow...
Ligand InfoPC cidPC sid
In DepthDetails ArticlePubMed