BDBM50457087 CHEMBL4205341
SMILES COCCOc1ccc(cc1)N1CCN(CCn2c3nc(N)n4nc(nc4c3n(C)c2=O)-c2ccco2)CC1
InChI Key InChIKey=DZAZOXNQTRLVNU-UHFFFAOYSA-N
Data  4 KI
  Tab Delimited (TSV)   2D SDfile   Computed 3D by Vconf -m prep SDfile
Find this compound or compounds like it in BindingDB:
Activity Spreadsheet -- Enzyme Inhibition Constant Data from BindingDB
Found 4 hits for monomerid = 50457087
TargetAdenosine receptor A2a(Rattus norvegicus (rat))
Advinus Therapeutics
Curated by ChEMBL
LigandPNGBDBM50457087(CHEMBL4205341)
Affinity DataKi:  0.280nM. Assay description: Antagonist activity at rat A2A receptor assessed as reduction in CGS-21680-induced cAMP level pretreated for 15 mins followed by CGS-21680 addition m...
Ligand InfoPC cidPC sid
In DepthDetails ArticlePubMed
TargetAdenosine receptor A2a(Homo sapiens (Human))
Advinus Therapeutics
Curated by ChEMBL
LigandPNGBDBM50457087(CHEMBL4205341)
Affinity DataKi:  0.420nM. Assay description: Antagonist activity at human A2A receptor expressed in HEK293 cell membranes assessed as reduction in CGS-21680-induced cAMP level pretreated for 15 ...
Ligand InfoPC cidPC sid
In DepthDetails ArticlePubMed
TargetAdenosine receptor A2a(Homo sapiens (Human))
Advinus Therapeutics
Curated by ChEMBL
LigandPNGBDBM50457087(CHEMBL4205341)
Affinity DataKi:  2nM. Assay description: Displacement of [3H]ZM241385 from human A2A receptor expressed in HEK293 cell membranes after 90 mins radioligand binding assay
Ligand InfoPC cidPC sid
In DepthDetails ArticlePubMed
TargetAdenosine receptor A1(Homo sapiens (Human))
Advinus Therapeutics
Curated by ChEMBL
LigandPNGBDBM50457087(CHEMBL4205341)
Affinity DataKi:  1.70E+3nM. Assay description: Displacement of [3H]-DPCPX from human A1 receptor expressed in HEK293 cell membranes after 90 mins radioligand binding assay
Ligand InfoPC cidPC sid
In DepthDetails ArticlePubMed