BDBM50457135 CHEMBL4203897
SMILES CNC(=O)c1cccc(c1)-c1ccc2N([C@@H](C)CN(C(=O)c3ccco3)c2c1)C(C)=O
InChI Key InChIKey=BNLUHUAAWOCZIZ-HNNXBMFYSA-N
Data  1 IC50
PDB links: 1 PDB ID matches this monomer.
  Tab Delimited (TSV)   2D SDfile   Computed 3D by Vconf -m prep SDfile
Find this compound or compounds like it in BindingDB:
Activity Spreadsheet -- Enzyme Inhibition Constant Data from BindingDB
Found 1 hit for monomerid = 50457135
TargetBromodomain-containing protein 4(Homo sapiens (Human))
Forma Therapeutics
Curated by ChEMBL
LigandPNGBDBM50457135(CHEMBL4203897)
Affinity DataIC50:  790nM. Assay description: Inhibition of His-epitope tagged BRD4 bromodomain 1 (44 to 168 residues) (unknown origin) using biotinylated K5,8,12,16 tetra-acetylated histone H4 (...
Ligand InfoPC cidPC sidPDB