BDBM50457557 CHEMBL4215630
SMILES COCCOCOc1ccc(cc1-c1ccc2c(c1)C(C)(C)CCC2(C)C)-c1ccc(cc1C)C(O)=O
InChI Key InChIKey=IFUOBHMVWSKKKO-UHFFFAOYSA-N
Data  1 EC50
  Tab Delimited (TSV)   2D SDfile   Computed 3D by Vconf -m prep SDfile
Find this compound or compounds like it in BindingDB:
Activity Spreadsheet -- Enzyme Inhibition Constant Data from BindingDB
Found 1 hit for monomerid = 50457557
TargetRetinoic acid receptor gamma(Homo sapiens (Human))
Nestle Skin Health
Curated by ChEMBL
LigandPNGBDBM50457557(CHEMBL4215630)
Affinity DataEC50:  120nM. Assay description: Agonist activity at GAL4 DNA-binding domain-tagged RARgamma (unknown origin) ligand-binding domain expressed in human HG5LN cells incubated for 18 hr...
Ligand InfoPC cidPC sid
In DepthDetails ArticlePubMed